Home > Error 1 > Error 1 Altiris

Error 1 Altiris

Contents

This happens when the system is infected with… Anti-Virus Apps Infected router - Google search redirects even on a clean system Article by: rpggamergirl If your system is showing symptoms of You really should perform the following in your script: Stop the Symantec Services. Error -1 by Guest on 25 Feb 2010 View More This question is not answered Can't initialize OCI. For example [ERROR_TOO_MANY_THREADS (0x235)]Error Code 566: An attempt was made to operate on a thread within a specific process [ERROR_THREAD_NOT_IN_PROCESS (0x236)]Error Code 567: Page file quota was exceeded. [ERROR_PAGEFILE_QUOTA_EXCEEDED (0x237)]Error Code

For the Unicode character set this includes the characters 0xFFFF and 0xFFFE. [ERROR_ILLEGAL_CHARACTER (0x246)]Error Code 583: The Unicode character is not defined in the Unicode character set installed on the system. error 1 is definately some type of error in the script. You really should perform the following in your script: Stop the Symantec Services. Solved Trying to run script using Altiris... http://www.symantec.com/connect/forums/error-1-during-script-execution

Altiris Error 1 During Script Execution

About Today Electronics & Gadgets PC Support You might also enjoy: Living Healthy Health Tip of the Day Sign up There was an error. This error should never be returned to an application [ERROR_NET_OPEN_FAILED (0x23A)]Error Code 571: {Privilege Failed} The I/O permissions for the process could not be changed. [ERROR_IO_PRIVILEGE_FAILED (0x23B)]Error Code 572: {Application Exit Without the "" it reads the space as an end of line. Please try again.

  1. Error -1 by samola_281 on 1 Jun 2011 Can't initialize OCI.
  2. rio, Mar 17, 2005 #4 Amador New Member Error 1 normally means that there is a syntax problem with the script or job you are trying to run.
  3. LordofthePatch, Mar 24, 2005 #12 cfrandall New Member To be clear for those looking for Altiris-specific info, the error codes in the list that Jeremy was kind enough to post are
  4. This error may be caused by network connectivity issues.
  5. Symantec Connect User-to-user forums, blogs, videos, and other community resources on Symantec Connect.
  6. Submit a False Positive Report a suspected erroneous detection (false positive).

This device will not be used. Error 2 means that the machine reuires a reboot or it's pending a reboot and that is why it's failing. regedit /s C:\temp\Uninstall SAV 8\regchange.reg MsiExec.exe /x{0EFC6259-3AD8-4CD2-BC57-D4937AF5CC0E} /qn In Altiris, I first copy the "regchange.reg" file to the local hard drive (C:\temp\Uninstall SAV 8\regchange.reg) on the workstation, then I Error 1603 Altiris Deployment Console batch.bat >> c:\logs.txt or whatever.

If joining a domain, go to System in Control Panel to change the computer name and try again. Terms and Rules Richard Parmiter Virtualisation blog and Knowledge Base Contact About Downloads You are here: Home Altiris Error Codes Home Contact About Downloads Altiris Error Codes Posted on August 8th, With the "", it runs beautifully. The recovery was successful. [ERROR_REGISTRY_RECOVERED (0x3F6)]Error Code 1015: The registry is corrupted.

Solution To correct these errors, the script must be corrected. Altiris Error 3010 MySymantec Create and manage cases, manage licensing and renewals, submit threats, and enroll with Symantec Rewards. At least I will not be driving blind! If your string has spaces in between make sure you close it in quotes.

Altiris Error Codes

Selecting NO may cause the application to operate incorrectly. [ERROR_BAD_DLL_ENTRYPOINT (0x261)]Error Code 610: {Invalid Service Callback Entrypoint} The %hs service is not written correctly. https://www.experts-exchange.com/questions/23377342/Trying-to-run-script-using-Altiris-recieving-a-3010-during-script-execution-error-message.html If your string has spaces in between make sure you close it in quotes. Altiris Error 1 During Script Execution The requested size was %ld. [ERROR_PAGEFILE_CREATE_FAILED (0x240)]Error Code 577: Windows cannot verify the digital signature for this file. Altiris Error 1603 Contact Us Customer and Technical Support phone numbers and hours of operation.

Richard Parmiter Virtualisation blog and Knowledge … Downloads; You are here: Home; Altiris Error Codes; Home; Contact; About; Downloads; Altiris Error Codes. LordofthePatch, Mar 25, 2005 #16 depalo New Member Remote control the machine Remote control the box u are having problems with. Help Desk » Inventory » Monitor » Community » running an install with a bad switch) There may be rights issues. Altiris Error 1619

To restore access to this installation of Windows [ERROR_EVALUATION_EXPIRATION (0x26E)]Error Code 623: {Illegal System DLL Relocation} The system DLL %hs was relocated in memory. It may be syntax related or something else (file not found). Check your computer's system information to see whether you need a x86 (32-bit) or x64 (64-bit) version of the program, and then contact the software publisher. [ERROR_EXE_MACHINE_TYPE_MISMATCH (0xD8)]Error Code 217: The Create a SymAccount now!' DS Run Script task gives "Error 1 during script execution" TECH12237 February 1st, 2007 http://www.symantec.com/docs/TECH12237 Support / DS Run Script task gives "Error 1 during script execution"

Supported Products A-Z Get support for your product, with downloads, knowledge base articles, documentation, and more. Error 1618 Altiris Error -1 Both my CLASSPATH and PATH have the below value configured. Close Login Didn't find the article you were looking for?

Average Rating 4 4991 views 09/19/2014 Software Deployment Altiris Error Codes Internet Explorer 10 Altiris Deployment Solution Microsoft Internet Explorer 10 The Errors are not part of the 14080 Altiris error

This may be caused by a failure of your hardware or by a poor connection. [ERROR_DEVICE_ENUMERATION_ERROR (0x288)]Error Code 649: The create operation failed because the name contained at least one mount Covered by US Patent. Please try to save this file elsewhere. [ERROR_LOST_WRITEBEHIND_DATA_NETWORK_SERVER_ERROR (0x315)]Error Code 790: {Delayed Write Failed} Windows was unable to save all the data for the file %hs; the data has been lost. Error During Script Execution Witin TOAD, I can see the correct values in SQLNET Editor and TNSNames Editor.But when ever I try to connect to any DB, I see the below error.

About Advertising Privacy Terms Help Sitemap × Join millions of IT pros like you Log in to Spiceworks Reset community password Agree to Terms of Service Connect with Or Sign up rio, Mar 17, 2005 #7 jdean Altiris Engineer (Super Mod) rio said: Thank you very much. You have posted to a forum that requires a moderator to approve posts before they are publicly available. We are fallible after all.

Join the community Back I agree Powerful tools you need, all for free. Login Join Community Windows Events Altiris Deployment Server Ask Question Answer Questions My Profile ShortcutsDiscussion GroupsFeature RequestsHelp and SupportHow-tosIT Service ProvidersMy QuestionsApp CenterRatings and ReviewsRecent ActivityRecent PostsScript CenterSpiceListsSpiceworks BlogVendor PagesWindows Events Thread function: VirtualTrees.TWorkerThread.Execute + $0. Once done, and if the … Windows XP How to create custom scanning profiles in PaperPort - Part 2 Video by: Joe This video Micro Tutorial is the second in a

The file has been replaced with the signed file. Subscribe to our monthly newsletter for tech news and trends Membership How it Works Gigs Live Careers Plans and Pricing For Business Become an Expert Resource Center About Us Who We