Home > Error 1 > Eclipse Make Error 127

Eclipse Make Error 127

Contents

If no * is attached to the message, then the subprocess failed but the rule in the makefile was prefixed with the - special character, so make ignored the error. So everything seems to be fine, except for the two errors I told you about. There is absolutely no reason why g++ from the repositories shouldn't work. So I installed it...now I get this error message when trying to compile the Hello World program: Code: Description Resource Path Program "g++" not found in PATH Preferences, C++/Build/Settings/Discovery, [CDT GCC http://dssoundware.com/error-1/eclipse-error-127.php

Can you try installing like this again, and give us any error messages you receive? May 23, 2007 - 06:22 AM 12345Total votes: 0 Am new to avr32 studio, Now am installed it and trying for debugging test program. I have installed gcc! > > Try installing gcc-c++ Code: sudo zypper in gcc-c++ -- GNOME 3.10.2 openSUSE 13.1 (Bottle) (x86_64) 64-bit Kernel Linux 3.11.6-4-desktop Thank you, I installed it. Now I get only two errors: Code: /bin/sh: g++: command not found make:*** [src/helloworld.o] Error 127 Any way out of this? http://stackoverflow.com/questions/3478877/eclipse-make-error-127

Make Error 127 C++

Randy Rainwater Tags:Tools, In-System Debuggers and Programmers Log in / register to post comments Top wrr01 Level: New Member Joined: Thu. and any errors numbers of form, ‘[foo] Error NN’ ‘[foo] signal description’ These errors are not really make errors at all. Can we say "He is accountable but not blamable" ?

in the problems perspective i get this error: Severity and Description Path Resource Location Creation Time Id make: *** [dip204.o] Error 127 HelloWorld line 0 1177021265250 14 and these warnings: Severity HelloWorld pathentry 1177019852140 11 Invalid project path: Include path not found (\usr\lib\gcc\i686-pc-cygwin\3.4.4\include). This book contains many real life examples derived from the author's experience as a Linux system and network administrator, trainer and consultant. Make Error 127 Ubuntu asked 6 years ago viewed 22019 times active 2 years ago Linked 0 Eclipse CDT error: “make: *** [src/test2.o] Error 127” Related 819R cannot be resolved - Android error929'Must Override a

Can I get more details about error 127? Eclipse Make Error 1 Apr 20, 2007 - 02:49 AM 12345Total votes: 0 I found part of my problem. Try running it some other way, like from the Windows command prompt, or even explorer. can we configure the eclipse to use the gcc instead of generating g++ commands ??

Build complete for project HelloWorld I tried loading a cygwin console and get a response from: make -? Gnu Make Error 127 Posting in the Forums implies acceptance of the Terms and Conditions. This seems like it has to be path problems and or cygwin problems. What output do you get when you run "g++" in a terminal window? /usr/bin/g++ is part of the package "gcc-g++" which you already was advised to install and apparently did install,

Eclipse Make Error 1

I am getting the following error when I do a project build for the "HelloWorld.cpp" Eclipse sample program: make: *** [HelloWorld.o] error 127 I am somewhat certain it is caused by https://www.raspberrypi.org/forums/viewtopic.php?t=52639&p=404553 Nothing in these materials is an offer to sell any of the components or devices referenced herein. Make Error 127 C++ I posted the result of the command in an edit above. –Xoorath Aug 13 '10 at 18:30 Yeah, it wasn't supposed to fix it... Make Error 127 Cygwin current community chat Stack Overflow Meta Stack Overflow your communities Sign up or log in to customize your list.

Note that registered members see fewer ads, and ContentLink is completely disabled once you log in. ShareFacebook Like (HTML5)Google Plus OneTweet WidgetLinkedin Share Button Search Site Sign Up for Developer News E-mail * Leave this field blank Follow UsYoutubeSlideshareRSSGet StartedAndroid DevelopmentEmbedded ComputingGaming & GraphicsInternet of ThingsWhy Snapdragon The time now is 21:25. Since then I've paid the $10 from that website that offers a turn key solution and I have been able to compile and debug a program on the RPi from a Make Error 127 Linux

If you are able to view the post, doesn't that mean it is already posted? As explained, I am able to invoke gcc from both cygwin and the windows prompt.When I do so, gcc does not output anything, not even its version (--version). Page generated in 0.02647 seconds .:: Contact :: Home ::. In Project properties I set GCC C compiler and linker to arm-angstrom-linux-gnueabi-gcc and assembler to arm-angstrom-linux-gnueabi-as Compiler include path is /home/daniel/Downloads/setup-scripts/build/tmp-angstrom_v2012_12-eglibc/sysroots/i686-linux/usr/include and linker library path is /home/daniel/Downloads/setup-scripts/build/tmp-angstrom_v2012_12-eglibc/sysroots/i686-linux/usr/lib When I build the

Can we say "He is accountable but not blamable" ? Make * * * Src Main O Error 127 And My makefile is automatically generated, I am not allowed to change makefile. So i move the 2 cygwin paths toward the front of the path statement.

Your Eclipse-for-Windows does not use the Cygwin variables at all.

Has Tony Stark ever "gone commando" in the Iron Man suit? Do "accountable", "responsible", "answerable" imply "blamable"? Borrow checker doesn't realize that `clear` drops reference to local variable What is the next big step in Monero's future? Make: : Command Not Found Error 127 share|improve this answer answered Aug 13 '10 at 18:53 Xoorath 3411619 add a comment| up vote 6 down vote Following are the values the make returns. 0 - if all makefiles

Still get that error. Any help to get this sorted will be greatly appreciated.Jean Posts: 6Joined: Mon Jan 21, 2013 8:15 pm by jjackowski » Tue Aug 13, 2013 11:42 pm That error is usually To start viewing messages, select the forum that you want to visit from the selection below. I'm sure its giving back error 127 when you request the version, too.

if not, how to install the g++ .. How can I resolve Error 127 in this case? Aneesh Log in or register to post comments Top mclayton Level: Rookie Joined: Sat. Randy Log in or register to post comments Top anivrm Level: New Member Joined: Tue.

Select Articles, Forum, or Blog. Browse other questions tagged c++ linux eclipse compiler-errors or ask your own question. So, here the case of make returning the value of 127, is returned by the shell not from make. Qt Centre is a community site devoted to programming in C++ using the Qt framework.

alisalehDecember 8th, 2008, 09:56 PMHello I made all the things mentioned in this thread and some other forums I checked that the GCC is installed with GCC -v, g++ -v,and make I installed gcc, and perhapse somebody here knows the difference, if so feel free to enlighten me. Its showing the error like **** Build of configuration Debug for project new **** make -k all make: Warning: File `subdir.mk' has modification time 0.45 s in the future Building file: Now I compiled the angstrom - environment from git://github.com/Angstrom-distribution/setup-scripts.git as described in datko.net/2013/05/06/cross-compiling-applications-for-the-beaglebone/ After some hours of compiling with oebb.sh I get many, many files and directories and am unsure which

Also a debug directory was created there and it had an error too. Apr 19, 2007 Posts: 12 View posts Location: Dallas #2 Posted by wrr01: Fri. Thank you. –Xoorath Aug 13 '10 at 23:41 1 I solved the same problem in a similiar way to @Xoorath. Also echo $0 --> bash.

I had to go into the console and do the following yum install gcc-c++ Thats it.